{"text_format":"1","workbook":"xlsx","n_sheets":12,"sheets":["INSTRUCTIONS","Updater","FOR COMPLETION","Lists","RISK ASSESSMENT","VALIDATION OF DATA ENTRY","FOR INFO Known Human RightRisks","FOR INFO Risk Metrics","2021 Review countries","2018-2019 Review countries","FOR INFO Low Risk Exemptions","US Dept List of Countries"],"not_rendered":{"charts":0,"images":0,"macros":1,"external_links":1,"defined_names":23,"comments":4,"pivot_tables":0},"unopened":[],"bounds":{"document_bytes":16777216,"sheet_cells":100000,"rows_first":2000,"rows_last":500,"rows_between":2000,"halvings":0,"cell_chars":16384,"cell_head_chars":4096},"cells_cut":0,"cells_raw":0,"read":"whole","date_system":"1900"}

{"sheet":"INSTRUCTIONS","index":0,"n_rows":78,"n_cols":2,"rows_kept":78,"cut":false,"hidden":false,"merged":[[62,1,62,18],[64,1,64,18],[57,1,57,18],[53,1,53,18],[66,1,66,18],[54,1,54,18],[60,1,60,18],[59,1,59,18],[58,1,58,18],[27,1,27,18],[25,1,25,18],[44,1,44,18],[45,1,45,18],[46,1,46,18],[41,1,41,18],[37,1,37,18],[38,1,38,18],[39,1,39,18],[31,1,31,18],[6,1,6,18],[7,1,7,18],[10,1,10,18],[12,1,12,18],[13,1,13,18],[8,1,8,18],[9,1,9,18],[11,1,11,18],[14,1,14,18],[56,1,56,18],[35,1,35,18],[51,1,51,18],[29,1,29,18],[33,1,33,18],[15,1,15,18],[55,1,55,18],[43,1,43,18],[52,1,52,18],[42,1,42,18],[23,1,23,18],[36,1,36,18],[40,1,40,18],[19,1,19,18],[21,1,21,18],[77,1,77,18],[47,1,47,18],[48,1,48,18],[49,1,49,18],[50,1,50,18],[71,1,71,18],[72,1,72,18],[73,1,73,18],[74,1,74,18],[69,1,69,18],[70,1,70,18],[63,1,63,18],[65,1,65,18],[67,1,67,18],[61,1,61,18],[68,1,68,18]]}
[]
[]
[]
[]
[]
[]
[null,"Introduction - FNET Supplier Risk Assessment V06 21st December 2021"]
[null,"Between May and October 2016, a group of 30 suppliers and five retailers developed a common supplier framework for assessing and addressing ethical trade risks. The FNET Risk Assessment was developed with input from these two groups to prevent duplication and encourage the adoption of standard approaches that met retailers’ needs whilst supporting supplier efforts to manage ethical trade in their supply chains.  \n\nBetween October and December 2018, FNET appointed Anthesis to conduct the update of the Country Risk Scores and Known HR Issues. Anthesis have developed a change to the methodology of calculating the composite country risk score index, based on weighting several labour and social rights indicators (with appropriate weightings fixed to each indicator), which meant that the 2018 Country Risk Scores were more normally distributed and not solely based on the highest indicator score available for a country. As a result of this change in methodology, Anthesis (with the support of Carnstone)  adjusted the risk rating thresholds to avoid unnecessary changes in ratings compared to 2017 tool. More information on the change of methodology is available on request. The same methodology has been used for the 2021 update of the tool. "]
{"$rows_left_out":71}
{"sheet":"Updater","index":1,"n_rows":2,"n_cols":1,"rows_kept":2,"cut":false,"hidden":true,"merged":[]}
["Auto update applied:"]
["#_NOV17_#"]

{"sheet":"FOR COMPLETION","index":2,"n_rows":24,"n_cols":15,"rows_kept":24,"cut":false,"hidden":false,"merged":[[14,7,14,10],[14,11,14,14]]}
[]
[]
[]
[]
[]
[]
[]
[]
{"$rows_left_out":17}
{"sheet":"Lists","index":3,"n_rows":53,"n_cols":7,"rows_kept":53,"cut":false,"hidden":true,"merged":[]}
["Risk Bins","Min","Max",null,null,null,"Ingredients List"]
["Low",0,237,null,null,null,"Bananas"]
["Medium",238,411,null,null,null,"Beef"]
["High",412,650,null,null,null,"Berries"]
[null,null,null,null,null,null,"Butter"]
[null,null,null,null,null,null,"Cheese"]
[null,null,null,null,null,null,"Chicken"]
[null,null,null,null,null,null,"Citrus"]
{"$rows_left_out":46}
{"sheet":"RISK ASSESSMENT","index":4,"n_rows":24,"n_cols":21,"rows_kept":24,"cut":false,"hidden":false,"merged":[[14,6,14,15],[14,16,14,20]]}
[null,null,null,null,null,null,"Y"]
[]
[]
[]
[]
[]
[]
[null,null,null,null,null,null,null,null,null,null,null,null,null,null,"Risk Scores"]
{"$rows_left_out":17}
{"sheet":"VALIDATION OF DATA ENTRY","index":5,"n_rows":24,"n_cols":6,"rows_kept":24,"cut":false,"hidden":false,"merged":[[6,1,6,5]]}
[]
[]
[]
[]
[]
[]
[null,"Please select the most appropriate pre-defined country and/or ingredient to replace\nthe unrecognised text, or leave blank for the entry to be ignored during the analysis."]
[null,"Unrecognised Country","Replace with",null,"Unrecognised Ingredient","Replace with"]
{"$rows_left_out":17}
{"sheet":"FOR INFO Known Human RightRisks","index":6,"n_rows":222,"n_cols":166,"rows_kept":222,"cut":false,"hidden":false,"merged":[[214,2,214,26],[23,163,24,163],[23,164,24,164]]}
[]
[]
[]
[null,null,"New","New",null,null,null,"New",null,null,null,null,null,null,null,null,null,null,null,null,null,null,null,null,null,null,null,null,null,"Renamed",null,"Renamed",null,null,null,null,null,"Merged",null,null,"Renamed",null,null,null,null,null,null,null,null,null,null,null,null,null,null,null,null,"Renamed","Renamed","Renamed","New",null,null,null,"New",null,null,null,null,null,null,null,null,null,null,null,null,"New",null,null,null,"New",null,null,null,null,null,null,null,null,null,null,null,null,null,null,null,null,null,null,null,null,null,"New",null,null,null,null,null,null,null,null,null,null,null,null,"New",null,null,null,null,null,null,"New","Renamed",null,"Renamed",null,null,null,null,null,null,null,null,null,null,null,null,null,null,null,null,null,null,null,null,null,null,null,null,"Renamed","Renamed",null,null,null,"Renamed",null,"Renamed",null,"New"]
[]
[]
[]
[]
{"$rows_left_out":215}
{"sheet":"FOR INFO Risk Metrics","index":7,"n_rows":218,"n_cols":24,"rows_kept":218,"cut":false,"hidden":false,"merged":[[25,9,27,20],[29,9,30,20],[6,18,7,20],[6,1,7,2],[6,6,7,7],[6,9,7,10],[6,12,7,13],[6,15,7,16]]}
[]
[]
[]
[]
[]
[]
[null,"COUNTRY RISK ",null,null,null,null,"BUYING CHANNEL",null,null,"KNOWN RISK OF SEVERE HUMAN RIGHTS ABUSES",null,null,"INDUSTRY RISKS",null,null,"TYPE OF LABOUR",null,null,"Risk Score"]
[]
{"$rows_left_out":211}
{"sheet":"2021 Review countries","index":8,"n_rows":18,"n_cols":34,"rows_kept":18,"cut":false,"hidden":false,"merged":[[0,3,0,11],[0,12,0,13],[0,14,0,23],[0,24,0,25],[1,3,1,11],[1,15,1,16],[1,17,1,18],[1,19,1,20],[1,21,1,22]]}
[null,null,null,"2020 Score",null,null,null,null,null,null,null,null,"Click to expand 2020 Indicator Scores",null,"2021 score",null,null,null,null,null,null,null,null,null,"Click to expand 2021 Indicator Scores",null,null,null,null,null,"Key"]
[null,null,null,"2020 Scores in FNET Tool",null,null,null,null,null,null,null,null,null,null,"UNDP","Modern Slavery",null,"ITUC",null,"Trafficking",null,"Governance",null,null,null,null,null,null,null,null,null,2018,2019,2021]
[null,null,"Country","2018 HDI Report"," GSI 2018 Modern Slavery Vulnerability Index"," GSI 2018 Modern Slavery Prevalence Index - log 10 transformed (RH)","Global Rights Index, ITUC, 2020","PROXIES INCLUDED Global Rights Index, ITUC, 2020","US StateDept 2019 Trafficking","FreedomHouse 2019 FIW","Transparency International 2019 Corruption Perception Index","UNICEF Children's Rights & Business Atlas (Outcome Workplace)","2020 SCORE","2020 RATING","2019 HDI Report","Modern Slavery Vulnerability Index,  GSI 2018 "," Modern Slavery Prevalence Index, GSI, 2018  - log 10 transformed (RH)","Global Rights Index, ITUC, 2021","PROXIES INCLUDED Global Rights Index, ITUC, 2021","Trafficking in Persons Report, US StateDept, 2021","GOC Human Trafficking Score 2021","Freedom in the World, Freedom House, 2021","Transparency International 2020 Corruption Perception Index","UNICEF Children's Rights & Business Atlas (Outcome Workplace)","2021 SCORE","2021 RATING",null,"Variance 2021 - 2020","2021 Comments",null,"High",47,47,47]
[null,null,"Armenia",42.857142857142854,43.626346347056526,50.589000000000006,"NR",66.666666666666657,57.142857142857139,49,58,39,53.052765947625062,"High",42.857142857142854,43.626346347056526,50.589000000000006,33.333333333333329,33.333333333333329,57.142857142857139,35,45,51,39,42.758606746359931,"Moderate",null,{"$f":"Y4-M4","v":-10.294159201265131},"Armenia has been included in the ITUC Global Rights Index 2021 for the first time. We have previously used a proxy for this country, so the new availability of data has caused greater accuracy in the country score. Armenia have been given a rating of 2 (repeated violations of rights), which is an improvement on the proxy score that was previously given. This has caused a positive reduction in their country score and enabled the rating to move from high to moderate. ",null,"Moderate","21-47","21-47","21-47"]
[null,null,"Kosovo","NR",43.813015759548563,39.275999999999996,"NR",66.666666666666657,57.142857142857139,46,64,45,54.615126530153539,"High","NR",43.813015759548563,39.275999999999996,"NR",33.333333333333329,57.142857142857139,"NR",46,64,45,45.09136462491545,"Moderate",null,-9.5237619052380893,"Kosovo does not have data for the ITUC score and as such a proxy is generated based on their categorisation in the UNDP Human Development Index, as per the methodology used. However, Kosovo also does not have a rating within the UNDP Human Development Index because they are not classified as a UN member. We have therefore used Serbia as a proxy for Kosovo due to the similar nature of their countries and development, which is consistent in the methodology used for the previous calculations within the tool. For this reporting period Serbia has been upgraded to 'Very High Human Development' within the HDI ratings, which has caused a positive decrease in the score for Kosovo. ",null,"Low","<21","<21","<21"]
[null,null,"Sudan",88.888888888888886,87.053999341847444,85.457999999999998,100,100,71.428571428571431,93,84,62,83.087634093790101,"High",90.476190476190467,87.053999341847444,85.457999999999998,83.333333333333343,83.333333333333343,57.142857142857139,80,83,84,62,78.019599059854713,"High",null,-5.0680350339353879,"ITUC Global Rights Index rating has decreased from 6 to 5, meaning there are now 'No guarantee of rights' as opposed to 'no guarantee of rights due to a breakdown of the rule of law'. This has resulted in a positive decrease in the score. The ITUC report has also highlighted how a trade-union-led alliance forced President Omar al-Bashir from power, however basic workers' rights continue to be violated. \n\nThe Trafficking in Persons rating for 2021 has also improved slightly from 'Tier 2 watch list' to 'Tier 2' due to the government demonstrating overall increased efforts compared to the previous reporting period. Examples of this improved activity include security forces stopping the forcible recruitment and use of child soldiers; the government having drafted and passed amendments to the 2014 anti-trafficking law that criminalized sex trafficking as well as labour trafficking; and officials investigating more potential cases and convicting more traffickers."]
[null,null,"Greece",16.93121693121693,37.133675470772964,67.31,83.333333333333343,83.333333333333343,57.142857142857139,13,52,35,51.238993634655259,"High",16.93121693121693,37.133675470772964,67.31,66.666666666666657,66.666666666666657,57.142857142857139,55.000000000000007,13,50,35,46.972024161492833,"Moderate",null,-4.2669694731624261,"The ITUC Global Rights Index rating for Greece in 2021 decreased from 5 to 4. Greece now has a rating of 'Systematic violations of rights', meaning that the situation for workers has improved from 'No guarantee of rights'. Greece has been highlighted in the report as one of eight countries that has seen their rating improve over this time period. \n\nThe score for Greece within the Transparency International Corruption Perception Index has also improved for 2021. Since 2012, the score for Greece has improved by 14 points. This is the highest improvement recorded within the report and means that significant progress has been made to reduce corruption in the country. The improved rating for the ITUC index and score for the Corruption Perception Index has resulted in a positive decrease of the overall score from Greece and meant the country has moved into the moderate risk rating. \n"]
[null,null,"Tunisia",48.148148148148145,39.197821043964908,17.007000000000001,66.666666666666657,66.666666666666657,57.142857142857139,31,57,37,47.643758215302547,"High",50.793650793650791,39.197821043964908,17.007000000000001,66.666666666666657,66.666666666666657,57.142857142857139,40,29,56,37,46.582521684810708,"Moderate",null,-1.0612365304918399,"Tunisia have experienced a small positive decrease in their score, and as they were close to the boundary this has caused their rating to be reduced from High to Moderate. The small improvement in their scores can be seen within the Freedom in the World report and the Transparency International Corruption Perception Index, however these are so small that they have not been specifically outlined in either report.\n \nThe Global Organised Crime Index has given Tunisia a moderate score for Human Trafficking, explaining that the human trafficking market is not as sizeable in Tunisia as in other countries in North Africa but the prevalence of several forms of trafficking is an issue. The inclusion of this index within the ratings has also caused the positive decrease in Tunisia's overall country score and rating. "]
{"$rows_left_out":11}
{"sheet":"2018-2019 Review countries","index":9,"n_rows":51,"n_cols":32,"rows_kept":51,"cut":false,"hidden":false,"merged":[[0,3,0,11],[0,12,0,13],[0,14,0,22],[0,23,0,24],[1,3,1,11],[1,15,1,16],[1,17,1,18],[1,20,1,21]]}
[null,null,null,"2018 Score",null,null,null,null,null,null,null,null,"Click to expand 2018 Indicator Scores",null,"NEW 2019 Score + 2020 ITUC Index",null,null,null,null,null,null,null,null,"Click to expand 2019 Indicator Scores",null,null,null,null,null,"Key"]
[null,null,null,"2018 Scores in FNET Tool",null,null,null,null,null,null,null,null,null,null,"UNDP","Modern Slavery",null,"ITUC",null,"Trafficking","Governance",null,null,null,null,null,null,null,null,null,2018,2019]
[null,null,"Country","2017 HDI Report"," GSI 2018 Modern Slavery Vulnerability IndeX"," GSI 2018 Modern Slavery Prevlance Index - log 10 transformed (RH)","[Global Rights Index - source 1-5+ scale (sub. 5+ with 6)]","PROXIES INCLUDED[Global Rights Index - source 1-5+ scale (sub. 5+ with 6)]","US StateDept 2018 Trafficking","FreedomHouse 2018 FIW","Transparency International 2018 Corruption Perception Index","Unicef Childrens Rights & Business Atlas (Outcome Workplace)","2018 SCORE","2018 RATING","2018 HDI Report","Modern Slavery Vulnerability Index,  GSI 2018 "," Modern Slavery Prevlance Index, GSI, 2018  - log 10 transformed (RH)","Global Rights Index, ITUC, 2019","PROXIES INCLUDED Global Rights Index, ITUC, 2019","Trafficking in Persons Report, US StateDept, 2019","Freedom in the World, Freedom House, 2019","Transparency International 2019 Corruption Perception Index","Unicef Childrens Rights & Business Atlas (Outcome Workplace)","NEW 2019 Score","NEW 2019 RATING",null,"2019 Advisory Statements","Comment",null,"High",47,47]
[null,null,"Korea (North)",100,73.302951914026167,100,"NR",100,85.714285714285708,97,83,65,85.062455748961057,"High",100,73.302951914026167,100,"NR",100,85.714285714285708,97,83,65,85.062520658583736,"High",null,null,"No significant change",null,"Moderate","21-47","21-47"]
[null,null,"Afghanistan",88.421052631578945,93.924621009113324,100,"NR",66.666666666666657,57.142857142857139,74,85,61.900000000000006,74.183051160514893,"High",89.947089947089935,93.924621009113324,100,83.333333333333343,83.333333333333343,71.428571428571431,73,84,62,78.63068222900155,"High",null,null,"Newly added to ITUC, and significant increase to Trafficking index score. \n\nITUC 2019:  the authorities intensified their repression against the National Union of Afghanistan Workers and Employees (NUAWE) by raiding the union’s offices several times in April and May 2018 and by instructing the Justice Ministry to cancel NUAWE’s registration unless it handed over its legally acquired property to the government. ",null,"Low","<21","<21"]
[null,null,"Iran",31.578947368421051,63.301785403368036,98.778999999999996,83.333333333333343,83.333333333333343,85.714285714285708,82,70,50.300000000000004,72.617335011805196,"High",34.391534391534393,63.301785403368036,98.778999999999996,83.333333333333343,83.333333333333343,85.714285714285708,82,74,50,73.44802744965952,"High",null,null,"No significant change"]
[null,null,"Iraq",63.157894736842103,85.726912558131872,46.555,66.666666666666657,66.666666666666657,71.428571428571431,69,82,53,67.56775565891418,"High",63.492063492063487,85.726912558131872,46.555,83.333333333333343,83.333333333333343,71.428571428571431,68,80,53,70.748002391146315,"High",null,null,"ITUC increase to Tier 5. ITUC 2019: Rise in attacks on workers' rights in law and practice, resulted in worsened ITUC rating. "]
[null,null,"Myanmar",77.89473684210526,65.916926671018629,81.637,66.666666666666657,66.666666666666657,"NR",69,70,64.3,63.399430136365275,"High",76.719576719576722,65.916926671018629,81.637,66.666666666666657,66.666666666666657,85.714285714285708,70,71,64,69.791300497677312,"High",null,null,"Data now available for Trafficking, has increased score 6 points."]
{"$rows_left_out":44}
{"sheet":"FOR INFO Low Risk Exemptions","index":10,"n_rows":33,"n_cols":2,"rows_kept":33,"cut":false,"hidden":false,"merged":[[32,1,32,14],[6,1,6,18],[7,1,7,18],[8,1,8,18],[9,1,9,18],[27,1,27,18],[28,1,28,18]]}
[]
[]
[]
[]
[]
[]
[null,"Low Risk Exemptions"]
[null,"The Low Risk Exemptions tab is to be used by suppliers with large numbers of products, ingredients, sub-components etc to remove any ingredients or raw materials that are located in low risk countries or low risk industries"]
{"$rows_left_out":26}
{"sheet":"US Dept List of Countries","index":11,"n_rows":209,"n_cols":9,"rows_kept":209,"cut":false,"hidden":true,"merged":[]}
[]
[null,null,"US Dept of State","Vlookup to Known Human rights risks","Vlookup to Country list","Status",null,null,"Countries/ Dependencies with no Country Level Risk Indec Score"]
[null,null,"Afghanistan",{"$f":"VLOOKUP(C3,CountryList,1,0)","v":"Afghanistan"},{"$f":"VLOOKUP(C3,'FOR INFO Risk Metrics'!$B$11:$B$211,1,0)","v":"Afghanistan"},"Independent State",null,null,"Country names/ spelling differ between FNET tool and US Dept of State"]
[null,null,"Albania","Albania",{"$f":"VLOOKUP(C4,'FOR INFO Risk Metrics'!$B$11:$B$211,1,0)","v":"Albania"},"Independent State",null,null,"Country names updated"]
[null,null,"Algeria","Algeria",{"$f":"VLOOKUP(C5,'FOR INFO Risk Metrics'!$B$11:$B$211,1,0)","v":"Algeria"},"Independent State"]
[null,null,"Andorra","Andorra",{"$f":"VLOOKUP(C6,'FOR INFO Risk Metrics'!$B$11:$B$211,1,0)","v":"Andorra"},"Independent State"]
[null,null,"Angola","Angola",{"$f":"VLOOKUP(C7,'FOR INFO Risk Metrics'!$B$11:$B$211,1,0)","v":"Angola"},"Independent State"]
[null,null,"Antigua and Barbuda","Antigua and Barbuda",{"$f":"VLOOKUP(C8,'FOR INFO Risk Metrics'!$B$11:$B$211,1,0)","v":"Antigua and Barbuda"},"Independent State"]
{"$rows_left_out":201}